Reaction Details
TargetCarbonic anhydrase 7
LigandBDBM50428813
Substrate/Competitorn/a
Meas. Tech.ChEMBL_949342 (CHEMBL2339340)
Ki 320±n/a nM
Citation Gavernet, LGonzalez Funes, JLPalestro, PHBruno Blanch, LEEstiu, GLMaresca, ABarrios, ISupuran, CT Inhibition pattern of sulfamide-related compounds in binding to carbonic anhydrase isoforms I, II, VII, XII and XIV. Bioorg Med Chem21:1410-8 (2013) 
 
Carbonic anhydrase 7
Name:Carbonic anhydrase 7
Type:Enzyme
Mol. Mass.:29664.11
Organism:Homo sapiens (Human)
Description:Human cloned isozyme.
Residue:264
BDBM50428813
NameBDBM50428813
Synonyms:CHEMBL375030
TypeSmall organic molecule
Emp. Form.C11H24N2O4S
Mol. Mass.280.384
SMILESCCCN(CCC)S(=O)(=O)NC(=O)OC(C)(C)C