Reaction Details
TargetCarbonic anhydrase 2
LigandBDBM50428800
Substrate/Competitorn/a
Meas. Tech.ChEMBL_949343 (CHEMBL2339341)
Ki>200000±n/a nM
Citation Gavernet, LGonzalez Funes, JLPalestro, PHBruno Blanch, LEEstiu, GLMaresca, ABarrios, ISupuran, CT Inhibition pattern of sulfamide-related compounds in binding to carbonic anhydrase isoforms I, II, VII, XII and XIV. Bioorg Med Chem21:1410-8 (2013) 
 
Carbonic anhydrase 2
Name:Carbonic anhydrase 2
Type:Enzyme
Mol. Mass.:29250.71
Organism:Homo sapiens (Human)
Description:P00918
Residue:260
BDBM50428800
NameBDBM50428800
Synonyms:CHEMBL199831 | Methyl 3-(Butylsulfamoylamino)Propanoate
TypeSmall organic molecule
Emp. Form.C8H18N2O4S
Mol. Mass.238.305
SMILESCCCCNS(=O)(=O)NCCC(=O)OC