Reaction Details
TargetCarbonic anhydrase 2
LigandBDBM50428812
Substrate/Competitorn/a
Meas. Tech.ChEMBL_949343 (CHEMBL2339341)
Ki 650±n/a nM
Citation Gavernet, LGonzalez Funes, JLPalestro, PHBruno Blanch, LEEstiu, GLMaresca, ABarrios, ISupuran, CT Inhibition pattern of sulfamide-related compounds in binding to carbonic anhydrase isoforms I, II, VII, XII and XIV. Bioorg Med Chem21:1410-8 (2013) 
 
Carbonic anhydrase 2
Name:Carbonic anhydrase 2
Type:Enzyme
Mol. Mass.:29250.71
Organism:Homo sapiens (Human)
Description:P00918
Residue:260
BDBM50428812
NameBDBM50428812
Synonyms:BENZYL(BENZYLSULFAMOYL)AMINE | N,N''-Dibenzylsulfamide
TypeSmall organic molecule
Emp. Form.C14H16N2O2S
Mol. Mass.276.354
SMILESO=S(=O)(NCc1ccccc1)NCc1ccccc1