Reaction Details
TargetCarbonic anhydrase 1
LigandBDBM50428817
Substrate/Competitorn/a
Meas. Tech.ChEMBL_949344 (CHEMBL2339342)
Ki 3660±n/a nM
Citation Gavernet, LGonzalez Funes, JLPalestro, PHBruno Blanch, LEEstiu, GLMaresca, ABarrios, ISupuran, CT Inhibition pattern of sulfamide-related compounds in binding to carbonic anhydrase isoforms I, II, VII, XII and XIV. Bioorg Med Chem21:1410-8 (2013) 
 
Carbonic anhydrase 1
Name:Carbonic anhydrase 1
Type:Enzyme
Mol. Mass.:28873.37
Organism:Homo sapiens (Human)
Description:P00915
Residue:261
BDBM50428817
NameBDBM50428817
Synonyms:CHEMBL2335232 | Hexyl Sulfamate
TypeSmall organic molecule
Emp. Form.C6H15NO3S
Mol. Mass.181.253
SMILESCCCCCCOS(N)(=O)=O