Reaction Details
TargetVascular endothelial growth factor A
LigandBDBM50129952
Substrate/Competitorn/a
Meas. Tech.ChEMBL_942631 (CHEMBL2339393)
Kd 17±n/a nM
Citation Pesca, MSDal Piaz, FSanogo, RVassallo, ABruzual de Abreu, MRapisarda, AGermanò, MPCerto, GDe Falco, SDe Tommasi, NBraca, A Bioassay-guided isolation of proanthocyanidins with antiangiogenic activities. J Nat Prod76:29-35 (2013) 
 
Vascular endothelial growth factor A
Name:Vascular endothelial growth factor A
Type:Protein
Mol. Mass.:27063.81
Organism:Homo sapiens (Human)
Description:P15692
Residue:232
BDBM50129952
NameBDBM50129952
Synonyms:2-(3-(5,7-dihydroxy-2-(4-hydroxyphenyl)-4-oxo-4H-chromen-8-yl)-4-hydroxyphenyl)-5,7-dihydroxy-4H-chromen-4-one Amentoflavone cid_5281600
TypeSmall organic molecule
Emp. Form.C30H18O10
Mol. Mass.538.4579
SMILESOc1ccc(cc1)-c1cc(=O)c2c(O)cc(O)c(-c3cc(ccc3O)-c3cc(O)c4c(cc(O)cc4=O)o3)c2o1