Reaction Details
TargetInterstitial collagenase
LigandBDBM50096480
Substrate/Competitorn/a
Meas. Tech.ChEMBL_944092 (CHEMBL2341925)
IC50 639±n/a nM
Citation Jain, PSaravanan, CSingh, SK Sulphonamides: Deserving class as MMP inhibitors? Eur J Med Chem60:89-100 (2013) 
 
Interstitial collagenase
Name:Interstitial collagenase
Type:Enzyme
Mol. Mass.:54010.26
Organism:Homo sapiens (Human)
Description: P03956
Residue:469
BDBM50096480
NameBDBM50096480
Synonyms:4-[Benzyl-(4-methoxy-benzenesulfonyl)-amino]-5-bromo-thiophene-3-carboxylic acid hydroxyamide | CHEMBL78826
TypeSmall organic molecule
Emp. Form.C19H17BrN2O5S2
Mol. Mass.497.383
SMILESCOc1ccc(cc1)S(=O)(=O)N(Cc1ccccc1)c1c(Br)scc1C(=O)NO