Reaction Details
TargetInterstitial collagenase
LigandBDBM50096476
Substrate/Competitorn/a
Meas. Tech.ChEMBL_944092 (CHEMBL2341925)
IC50 174±n/a nM
Citation Jain, PSaravanan, CSingh, SK Sulphonamides: Deserving class as MMP inhibitors? Eur J Med Chem60:89-100 (2013) 
 
Interstitial collagenase
Name:Interstitial collagenase
Type:Enzyme
Mol. Mass.:54010.26
Organism:Homo sapiens (Human)
Description: P03956
Residue:469
BDBM50096476
NameBDBM50096476
Synonyms:(R)-2-[Benzyl-(4-methoxy-benzenesulfonyl)-amino]-cyclohexanecarboxylic acid hydroxyamide | CHEMBL81113
TypeSmall organic molecule
Emp. Form.C21H26N2O5S
Mol. Mass.418.507
SMILESCOc1ccc(cc1)S(=O)(=O)N(Cc1ccccc1)C1CCCC[C@H]1C(=O)NO