Reaction Details
TargetStromelysin-1
LigandBDBM12074
Substrate/Competitorn/a
Meas. Tech.ChEMBL_944582 (CHEMBL2339487)
IC50 0.007000±n/a nM
Citation Jain, PSaravanan, CSingh, SK Sulphonamides: Deserving class as MMP inhibitors? Eur J Med Chem60:89-100 (2013) 
 
Stromelysin-1
Name:Stromelysin-1
Type:Enzyme
Mol. Mass.:53973.13
Organism:Homo sapiens (Human)
Description: P08254
Residue:477
BDBM12074
NameBDBM12074
Synonyms:(2R)-2-{[4-(4-bromophenyl)benzene]sulfonamido}-3-methylbutanoic acid alpha-arylsulfonylamino carboxylate 2R
TypeSmall organic molecule
Emp. Form.C17H18BrNO4S
Mol. Mass.412.298
SMILESCC(C)[C@@H](NS(=O)(=O)c1ccc(cc1)-c1ccc(Br)cc1)C(O)=O