Reaction Details
TargetCollagenase 3
LigandBDBM24025
Substrate/Competitorn/a
Meas. Tech.ChEMBL_944584 (CHEMBL2339489)
IC50 0.062000±n/a nM
Citation Jain, PSaravanan, CSingh, SK Sulphonamides: Deserving class as MMP inhibitors? Eur J Med Chem60:89-100 (2013) 
 
Collagenase 3
Name:Collagenase 3
Type:Enzyme
Mol. Mass.:53808.06
Organism:Homo sapiens (Human)
Description:P45452
Residue:471
BDBM24025
NameBDBM24025
Synonyms:(2R)-3-methyl-2-[(4-phenylbenzene)sulfonamido]butanoic acid biphenylsulfonamide carboxylate, 2
TypeSmall organic molecule
Emp. Form.C17H19NO4S
Mol. Mass.333.402
SMILESCC(C)[C@@H](NS(=O)(=O)c1ccc(cc1)-c1ccccc1)C(O)=O