Reaction Details
Target72 kDa type IV collagenase
LigandBDBM50428829
Substrate/Competitorn/a
Meas. Tech.ChEMBL_944583 (CHEMBL2339488)
IC50 3.3±n/a nM
Citation Jain, PSaravanan, CSingh, SK Sulphonamides: Deserving class as MMP inhibitors? Eur J Med Chem60:89-100 (2013) 
 
72 kDa type IV collagenase
Name:72 kDa type IV collagenase
Type:Enzyme
Mol. Mass.:73870.36
Organism:Homo sapiens (Human)
Description: P08253
Residue:660
BDBM50428829
NameBDBM50428829
Synonyms:CHEMBL2337130
TypeSmall organic molecule
Emp. Form.C19H18F4N2O5S
Mol. Mass.462.415
SMILESONC(=O)c1cccc(F)c1S(=O)(=O)N1CCC(CC1)Oc1ccc(cc1)C(F)(F)F