Reaction Details
Target72 kDa type IV collagenase
LigandBDBM50095218
Substrate/Competitorn/a
Meas. Tech.ChEMBL_944583 (CHEMBL2339488)
IC50 2.0±n/a nM
Citation Jain, PSaravanan, CSingh, SK Sulphonamides: Deserving class as MMP inhibitors? Eur J Med Chem60:89-100 (2013) 
 
72 kDa type IV collagenase
Name:72 kDa type IV collagenase
Type:Enzyme
Mol. Mass.:73870.36
Organism:Homo sapiens (Human)
Description: P08253
Residue:660
BDBM50095218
NameBDBM50095218
Synonyms:CHEMBL310008 N-Hydroxy-2-[4-(4-trifluoromethoxy-phenoxy)-piperidine-1-sulfonyl]-benzamide
TypeSmall organic molecule
Emp. Form.C19H19F3N2O6S
Mol. Mass.460.424
SMILESONC(=O)c1ccccc1S(=O)(=O)N1CCC(CC1)Oc1ccc(OC(F)(F)F)cc1