Reaction Details
Target72 kDa type IV collagenase
LigandBDBM50204371
Substrate/Competitorn/a
Meas. Tech.ChEMBL_944583 (CHEMBL2339488)
IC50 3600±n/a nM
Citation Jain, PSaravanan, CSingh, SK Sulphonamides: Deserving class as MMP inhibitors? Eur J Med Chem60:89-100 (2013) 
 
72 kDa type IV collagenase
Name:72 kDa type IV collagenase
Type:Enzyme
Mol. Mass.:73870.36
Organism:Homo sapiens (Human)
Description: P08253
Residue:660
BDBM50204371
NameBDBM50204371
Synonyms:2-{isopropoxy[(4-methoxyphenyl)sulfonyl]amino}-N-hydroxyacetamide N-hydroxy-2-(N-isopropoxy-4-methoxyphenylsulfonamido)acetamide
TypeSmall organic molecule
Emp. Form.C12H18N2O6S
Mol. Mass.318.346
SMILESCOc1ccc(cc1)S(=O)(=O)N(CC(=O)NO)OC(C)C