Reaction Details
Target72 kDa type IV collagenase
LigandBDBM50161331
Substrate/Competitorn/a
Meas. Tech.ChEMBL_944583 (CHEMBL2339488)
IC50 12±n/a nM
Citation Jain, PSaravanan, CSingh, SK Sulphonamides: Deserving class as MMP inhibitors? Eur J Med Chem60:89-100 (2013) 
 
72 kDa type IV collagenase
Name:72 kDa type IV collagenase
Type:Enzyme
Mol. Mass.:73870.36
Organism:Homo sapiens (Human)
Description: P08253
Residue:660
BDBM50161331
NameBDBM50161331
Synonyms:2-[(Biphenyl-4-sulfonyl)-isopropoxy-amino]-N-hydroxy-acetamide N-hydroxy-2-(N-isopropoxybiphenyl-4-ylsulfonamido)acetamide
TypeSmall organic molecule
Emp. Form.C17H20N2O5S
Mol. Mass.364.416
SMILESCC(C)ON(CC(=O)NO)S(=O)(=O)c1ccc(cc1)-c1ccccc1