Reaction Details
TargetCarbonic anhydrase 12
LigandBDBM50428838
Substrate/Competitorn/a
Meas. Tech.ChEMBL_944593 (CHEMBL2339498)
Ki 2.3±n/a nM
Citation Alafeefy, AMIsik, SAbdel-Aziz, HAAshour, AEVullo, DAl-Jaber, NASupuran, CT Carbonic anhydrase inhibitors: benzenesulfonamides incorporating cyanoacrylamide moieties are low nanomolar/subnanomolar inhibitors of the tumor-associated isoforms IX and XII. Bioorg Med Chem21:1396-403 (2013) 
 
Carbonic anhydrase 12
Name:Carbonic anhydrase 12
Type:Enzyme
Mol. Mass.:39456.00
Organism:Homo sapiens (Human)
Description:Catalytic domain of human cloned isozyme was used in the assay
Residue:354
BDBM50428838
NameBDBM50428838
Synonyms:CHEMBL2337530
TypeSmall organic molecule
Emp. Form.C16H13N3O5S
Mol. Mass.359.357
SMILESNS(=O)(=O)c1ccc(NC(=O)C(=C\c2ccc(O)c(O)c2)\C#N)cc1