Reaction Details
TargetCarbonic anhydrase 9
LigandBDBM50428830
Substrate/Competitorn/a
Meas. Tech.ChEMBL_944594 (CHEMBL2339499)
Ki 9.5±n/a nM
Citation Alafeefy, AMIsik, SAbdel-Aziz, HAAshour, AEVullo, DAl-Jaber, NASupuran, CT Carbonic anhydrase inhibitors: benzenesulfonamides incorporating cyanoacrylamide moieties are low nanomolar/subnanomolar inhibitors of the tumor-associated isoforms IX and XII. Bioorg Med Chem21:1396-403 (2013) 
 
Carbonic anhydrase 9
Name:Carbonic anhydrase 9
Type:Enzyme
Mol. Mass.:49669.03
Organism:Homo sapiens (Human)
Description:Catalytic domain of human cloned isozyme was used in the assay
Residue:459
BDBM50428830
NameBDBM50428830
Synonyms:CHEMBL2337537
TypeSmall organic molecule
Emp. Form.C15H13N5O3S
Mol. Mass.343.36
SMILESNS(=O)(=O)c1ccc(NC(=O)C(N=Nc2ccccc2)C#N)cc1