Reaction Details
TargetCarbonic anhydrase 9
LigandBDBM50428834
Substrate/Competitorn/a
Meas. Tech.ChEMBL_944594 (CHEMBL2339499)
Ki 4.3±n/a nM
Citation Alafeefy, AMIsik, SAbdel-Aziz, HAAshour, AEVullo, DAl-Jaber, NASupuran, CT Carbonic anhydrase inhibitors: benzenesulfonamides incorporating cyanoacrylamide moieties are low nanomolar/subnanomolar inhibitors of the tumor-associated isoforms IX and XII. Bioorg Med Chem21:1396-403 (2013) 
 
Carbonic anhydrase 9
Name:Carbonic anhydrase 9
Type:Enzyme
Mol. Mass.:49669.03
Organism:Homo sapiens (Human)
Description:Catalytic domain of human cloned isozyme was used in the assay
Residue:459
BDBM50428834
NameBDBM50428834
Synonyms:CHEMBL1347917
TypeSmall organic molecule
Emp. Form.C14H11N3O4S
Mol. Mass.317.32
SMILESNS(=O)(=O)c1ccc(NC(=O)C(=C\c2ccco2)\C#N)cc1