Reaction Details
TargetCarbonic anhydrase 2
LigandBDBM50428837
Substrate/Competitorn/a
Meas. Tech.ChEMBL_944595 (CHEMBL2339500)
Ki 34±n/a nM
Citation Alafeefy, AMIsik, SAbdel-Aziz, HAAshour, AEVullo, DAl-Jaber, NASupuran, CT Carbonic anhydrase inhibitors: benzenesulfonamides incorporating cyanoacrylamide moieties are low nanomolar/subnanomolar inhibitors of the tumor-associated isoforms IX and XII. Bioorg Med Chem21:1396-403 (2013) 
 
Carbonic anhydrase 2
Name:Carbonic anhydrase 2
Type:Enzyme
Mol. Mass.:29250.71
Organism:Homo sapiens (Human)
Description:P00918
Residue:260
BDBM50428837
NameBDBM50428837
Synonyms:CHEMBL2337531
TypeSmall organic molecule
Emp. Form.C16H13N3O4S
Mol. Mass.343.357
SMILESNS(=O)(=O)c1ccc(NC(=O)C(=C\c2ccc(O)cc2)\C#N)cc1