Reaction Details
TargetCarbonic anhydrase 1
LigandBDBM50428850
Substrate/Competitorn/a
Meas. Tech.ChEMBL_944596 (CHEMBL2339501)
Ki 116±n/a nM
Citation Alafeefy, AMIsik, SAbdel-Aziz, HAAshour, AEVullo, DAl-Jaber, NASupuran, CT Carbonic anhydrase inhibitors: benzenesulfonamides incorporating cyanoacrylamide moieties are low nanomolar/subnanomolar inhibitors of the tumor-associated isoforms IX and XII. Bioorg Med Chem21:1396-403 (2013) 
 
Carbonic anhydrase 1
Name:Carbonic anhydrase 1
Type:Enzyme
Mol. Mass.:28873.37
Organism:Homo sapiens (Human)
Description:P00915
Residue:261
BDBM50428850
NameBDBM50428850
Synonyms:CHEMBL2337539
TypeSmall organic molecule
Emp. Form.C19H15N5O4S2
Mol. Mass.441.484
SMILESCC(=O)C1=NN(\C(S1)=C(/C#N)C(=O)Nc1ccc(cc1)S(N)(=O)=O)c1ccccc1