Reaction Details
TargetCarbonic anhydrase 1
LigandBDBM50428830
Substrate/Competitorn/a
Meas. Tech.ChEMBL_944596 (CHEMBL2339501)
Ki 34±n/a nM
Citation Alafeefy, AMIsik, SAbdel-Aziz, HAAshour, AEVullo, DAl-Jaber, NASupuran, CT Carbonic anhydrase inhibitors: benzenesulfonamides incorporating cyanoacrylamide moieties are low nanomolar/subnanomolar inhibitors of the tumor-associated isoforms IX and XII. Bioorg Med Chem21:1396-403 (2013) 
 
Carbonic anhydrase 1
Name:Carbonic anhydrase 1
Type:Enzyme
Mol. Mass.:28873.37
Organism:Homo sapiens (Human)
Description:P00915
Residue:261
BDBM50428830
NameBDBM50428830
Synonyms:CHEMBL2337537
TypeSmall organic molecule
Emp. Form.C15H13N5O3S
Mol. Mass.343.36
SMILESNS(=O)(=O)c1ccc(NC(=O)C(N=Nc2ccccc2)C#N)cc1