Reaction Details
TargetCytochrome P450 3A4
LigandBDBM50428857
Substrate/Competitorn/a
Meas. Tech.ChEMBL_945618 (CHEMBL2344952)
IC50 2600±n/a nM
Citation Taygerly, JPMcGee, LRRubenstein, SMHouze, JBCushing, TDLi, YMotani, AChen, JLFrankmoelle, WYe, GLearned, MRJaen, JMiao, STimmermans, PBThoolen, MKearney, PFlygare, JBeckmann, HWeiszmann, JLindstrom, MWalker, NLiu, JBiermann, DWang, ZHagiwara, AIida, TAramaki, HKitao, YShinkai, HFurukawa, NNishiu, JNakamura, M Discovery of INT131: a selective PPAR¿ modulator that enhances insulin sensitivity. Bioorg Med Chem21:979-92 (2013) 
 
Cytochrome P450 3A4
Name:Cytochrome P450 3A4
Type:Enzyme
Mol. Mass.:57349.57
Organism:Homo sapiens (Human)
Description:n/a
Residue:503
BDBM50428857
NameBDBM50428857
Synonyms:CHEMBL2338472
TypeSmall organic molecule
Emp. Form.C21H13Cl3N2O3S
Mol. Mass.479.764
SMILESClc1ccc(c(Cl)c1)S(=O)(=O)Nc1ccc(Oc2cnc3ccccc3c2)c(Cl)c1