Reaction Details
TargetPeroxisome proliferator-activated receptor gamma
LigandBDBM50428859
Substrate/Competitorn/a
Meas. Tech.ChEMBL_946081 (CHEMBL2342574)
IC50 480±n/a nM
Citation Taygerly, JPMcGee, LRRubenstein, SMHouze, JBCushing, TDLi, YMotani, AChen, JLFrankmoelle, WYe, GLearned, MRJaen, JMiao, STimmermans, PBThoolen, MKearney, PFlygare, JBeckmann, HWeiszmann, JLindstrom, MWalker, NLiu, JBiermann, DWang, ZHagiwara, AIida, TAramaki, HKitao, YShinkai, HFurukawa, NNishiu, JNakamura, M Discovery of INT131: a selective PPAR¿ modulator that enhances insulin sensitivity. Bioorg Med Chem21:979-92 (2013) 
 
Peroxisome proliferator-activated receptor gamma
Name:Peroxisome proliferator-activated receptor gamma
Type:Nuclear Receptor
Mol. Mass.:57613.46
Organism:Homo sapiens (Human)
Description:P37231
Residue:505
BDBM50428859
NameBDBM50428859
Synonyms:CHEMBL2338476
TypeSmall organic molecule
Emp. Form.C22H14Cl3NO3S
Mol. Mass.478.775
SMILESClc1ccc(c(Cl)c1)S(=O)(=O)Nc1ccc(Oc2ccc3ccccc3c2)c(Cl)c1