Reaction Details
TargetPeroxisome proliferator-activated receptor gamma
LigandBDBM50428884
Substrate/Competitorn/a
Meas. Tech.ChEMBL_946080 (CHEMBL2342573)
EC50 15±n/a nM
Citation Taygerly, JPMcGee, LRRubenstein, SMHouze, JBCushing, TDLi, YMotani, AChen, JLFrankmoelle, WYe, GLearned, MRJaen, JMiao, STimmermans, PBThoolen, MKearney, PFlygare, JBeckmann, HWeiszmann, JLindstrom, MWalker, NLiu, JBiermann, DWang, ZHagiwara, AIida, TAramaki, HKitao, YShinkai, HFurukawa, NNishiu, JNakamura, M Discovery of INT131: a selective PPAR¿ modulator that enhances insulin sensitivity. Bioorg Med Chem21:979-92 (2013) 
 
Peroxisome proliferator-activated receptor gamma
Name:Peroxisome proliferator-activated receptor gamma
Type:Nuclear Receptor
Mol. Mass.:57613.46
Organism:Homo sapiens (Human)
Description:P37231
Residue:505
BDBM50428884
NameBDBM50428884
Synonyms:CHEMBL2331786
TypeSmall organic molecule
Emp. Form.C20H16Cl3N3O4S
Mol. Mass.500.783
SMILESCCNC(=O)c1cc(NS(=O)(=O)c2ccc(Cl)cc2Cl)ccc1Oc1cncc(Cl)c1