Reaction Details
TargetCytochrome P450 3A4
LigandBDBM50428878
Substrate/Competitorn/a
Meas. Tech.ChEMBL_945618 (CHEMBL2344952)
IC50 10.0±n/a nM
Citation Taygerly, JPMcGee, LRRubenstein, SMHouze, JBCushing, TDLi, YMotani, AChen, JLFrankmoelle, WYe, GLearned, MRJaen, JMiao, STimmermans, PBThoolen, MKearney, PFlygare, JBeckmann, HWeiszmann, JLindstrom, MWalker, NLiu, JBiermann, DWang, ZHagiwara, AIida, TAramaki, HKitao, YShinkai, HFurukawa, NNishiu, JNakamura, M Discovery of INT131: a selective PPAR¿ modulator that enhances insulin sensitivity. Bioorg Med Chem21:979-92 (2013) 
 
Cytochrome P450 3A4
Name:Cytochrome P450 3A4
Type:Enzyme
Mol. Mass.:57349.57
Organism:Homo sapiens (Human)
Description:n/a
Residue:503
BDBM50428878
NameBDBM50428878
Synonyms:CHEMBL2338479
TypeSmall organic molecule
Emp. Form.C18H9Cl4N3O3S
Mol. Mass.489.159
SMILESClc1ccc(c(Cl)c1)S(=O)(=O)Nc1cc(Cl)c(Oc2cncc(c2)C#N)c(Cl)c1