Reaction Details
TargetPeroxisome proliferator-activated receptor gamma
LigandBDBM50428889
Substrate/Competitorn/a
Meas. Tech.ChEMBL_946081 (CHEMBL2342574)
IC50>10000±n/a nM
Citation Taygerly, JPMcGee, LRRubenstein, SMHouze, JBCushing, TDLi, YMotani, AChen, JLFrankmoelle, WYe, GLearned, MRJaen, JMiao, STimmermans, PBThoolen, MKearney, PFlygare, JBeckmann, HWeiszmann, JLindstrom, MWalker, NLiu, JBiermann, DWang, ZHagiwara, AIida, TAramaki, HKitao, YShinkai, HFurukawa, NNishiu, JNakamura, M Discovery of INT131: a selective PPAR¿ modulator that enhances insulin sensitivity. Bioorg Med Chem21:979-92 (2013) 
 
Peroxisome proliferator-activated receptor gamma
Name:Peroxisome proliferator-activated receptor gamma
Type:Nuclear Receptor
Mol. Mass.:57613.46
Organism:Homo sapiens (Human)
Description:P37231
Residue:505
BDBM50428889
NameBDBM50428889
Synonyms:CHEMBL2331779
TypeSmall organic molecule
Emp. Form.C24H26ClN3O4S
Mol. Mass.487.999
SMILESCCNC(=O)c1cc(NS(=O)(=O)c2ccc(cc2)C(C)(C)C)ccc1Oc1cncc(Cl)c1