Reaction Details
TargetD(1A) dopamine receptor
LigandBDBM50429044
Substrate/Competitorn/a
Meas. Tech.ChEMBL_942282 (CHEMBL2343280)
Ki 4.2±n/a nM
Citation Sun, HZhu, LYang, HQian, WGuo, LZhou, SGao, BLi, ZZhou, YJiang, HChen, KZhen, XLiu, H Asymmetric total synthesis and identification of tetrahydroprotoberberine derivatives as new antipsychotic agents possessing a dopamine D(1), D(2) and serotonin 5-HT(1A) multi-action profile. Bioorg Med Chem21:856-68 (2013) 
 
D(1A) dopamine receptor
Name:D(1A) dopamine receptor
Type:Enzyme
Mol. Mass.:49303.43
Organism:Homo sapiens (Human)
Description:P21728
Residue:446
BDBM50429044
NameBDBM50429044
Synonyms:CHEMBL2334893 | US9359372, DC037029
TypeSmall organic molecule
Emp. Form.C19H19NO4
Mol. Mass.325.3585
SMILESCOc1cc2CCN3Cc4cc5OCOc5cc4C[C@H]3c2cc1O