Reaction Details
TargetBotulinum neurotoxin type A
LigandBDBM50429170
Substrate/Competitorn/a
Meas. Tech.ChEMBL_943587 (CHEMBL2343854)
Ki 27±n/a nM
Citation Šilhár, PSilvaggi, NRPellett, SCapková, KJohnson, EAAllen, KNJanda, KD Evaluation of adamantane hydroxamates as botulinum neurotoxin inhibitors: synthesis, crystallography, modeling, kinetic and cellular based studies. Bioorg Med Chem21:1344-8 (2013) 
 
Botulinum neurotoxin type A
Name:Botulinum neurotoxin type A
Type:PROTEIN
Mol. Mass.:149450.01
Organism:Clostridium botulinum
Description:ChEMBL_1510137
Residue:1296
BDBM50429170
NameBDBM50429170
Synonyms:CHEMBL2336715
TypeSmall organic molecule
Emp. Form.C18H22BrNO2
Mol. Mass.364.277
SMILESONC(=O)CC12CC3CC(C1)CC(C3)(C2)c1ccc(Br)cc1