Reaction Details
TargetBotulinum neurotoxin type A
LigandBDBM50429172
Substrate/Competitorn/a
Meas. Tech.ChEMBL_943587 (CHEMBL2343854)
Ki 130±n/a nM
Citation Šilhár, PSilvaggi, NRPellett, SCapková, KJohnson, EAAllen, KNJanda, KD Evaluation of adamantane hydroxamates as botulinum neurotoxin inhibitors: synthesis, crystallography, modeling, kinetic and cellular based studies. Bioorg Med Chem21:1344-8 (2013) 
 
Botulinum neurotoxin type A
Name:Botulinum neurotoxin type A
Type:PROTEIN
Mol. Mass.:149450.01
Organism:Clostridium botulinum
Description:ChEMBL_1510137
Residue:1296
BDBM50429172
NameBDBM50429172
Synonyms:CHEMBL2336713
TypeSmall organic molecule
Emp. Form.C19H25NO3
Mol. Mass.315.4067
SMILESCOc1ccc(cc1)C12CC3CC(CC(CC(=O)NO)(C3)C1)C2