Reaction Details
TargetTranslocator protein
LigandBDBM50429213
Substrate/Competitorn/a
Meas. Tech.ChEMBL_945637 (CHEMBL2344971)
Ki 0.130000±n/a nM
Citation Fukaya, TKodo, TIshiyama, TNishikawa, HBaba, SMasumoto, S Design, synthesis and structure-activity relationship of novel tricyclic benzimidazolone derivatives as potent 18 kDa translocator protein (TSPO) ligands. Bioorg Med Chem21:1257-67 (2013) 
 
Translocator protein
Name:Translocator protein
Type:Mitochondrion membrane protein
Mol. Mass.:18945.84
Organism:Rattus norvegicus (rat)
Description:Competitive binding experiments were performed on rat kidney mitochondrial membranes.
Residue:169
BDBM50429213
NameBDBM50429213
Synonyms:CHEMBL2332262
TypeSmall organic molecule
Emp. Form.C25H22ClN3O2
Mol. Mass.431.914
SMILESCN(C(=O)Cn1c2cc(cc3CCCn(c23)c1=O)-c1ccccc1)c1ccc(Cl)cc1