Reaction Details
TargetCarbonic anhydrase 12
LigandBDBM50429223
Substrate/Competitorn/a
Meas. Tech.ChEMBL_946163 (CHEMBL2343565)
Ki 31±n/a nM
Citation Güzel-Akdemir, ÖAkdemir, AIsik, SVullo, DSupuran, CT o-Benzenedisulfonimido-sulfonamides are potent inhibitors of the tumor-associated carbonic anhydrase isoforms CA IX and CA XII. Bioorg Med Chem21:1386-91 (2013) 
 
Carbonic anhydrase 12
Name:Carbonic anhydrase 12
Type:Enzyme
Mol. Mass.:39456.00
Organism:Homo sapiens (Human)
Description:Catalytic domain of human cloned isozyme was used in the assay
Residue:354
BDBM50429223
NameBDBM50429223
Synonyms:CHEMBL2332768
TypeSmall organic molecule
Emp. Form.C13H12N2O6S3
Mol. Mass.388.439
SMILESNS(=O)(=O)c1ccc(CN2S(=O)(=O)c3ccccc3S2(=O)=O)cc1