Reaction Details
TargetCarbonic anhydrase 12
LigandBDBM50429224
Substrate/Competitorn/a
Meas. Tech.ChEMBL_946163 (CHEMBL2343565)
Ki 35±n/a nM
Citation Güzel-Akdemir, ÖAkdemir, AIsik, SVullo, DSupuran, CT o-Benzenedisulfonimido-sulfonamides are potent inhibitors of the tumor-associated carbonic anhydrase isoforms CA IX and CA XII. Bioorg Med Chem21:1386-91 (2013) 
 
Carbonic anhydrase 12
Name:Carbonic anhydrase 12
Type:Enzyme
Mol. Mass.:39456.00
Organism:Homo sapiens (Human)
Description:Catalytic domain of human cloned isozyme was used in the assay
Residue:354
BDBM50429224
NameBDBM50429224
Synonyms:CHEMBL2332769
TypeSmall organic molecule
Emp. Form.C12H9ClN2O6S3
Mol. Mass.408.858
SMILESNS(=O)(=O)c1ccc(N2S(=O)(=O)c3ccccc3S2(=O)=O)c(Cl)c1