Reaction Details
TargetCarbonic anhydrase 2
LigandBDBM50429225
Substrate/Competitorn/a
Meas. Tech.ChEMBL_946165 (CHEMBL2344044)
Ki 55±n/a nM
Citation Güzel-Akdemir, ÖAkdemir, AIsik, SVullo, DSupuran, CT o-Benzenedisulfonimido-sulfonamides are potent inhibitors of the tumor-associated carbonic anhydrase isoforms CA IX and CA XII. Bioorg Med Chem21:1386-91 (2013) 
 
Carbonic anhydrase 2
Name:Carbonic anhydrase 2
Type:Enzyme
Mol. Mass.:29250.71
Organism:Homo sapiens (Human)
Description:P00918
Residue:260
BDBM50429225
NameBDBM50429225
Synonyms:CHEMBL2332770
TypeSmall organic molecule
Emp. Form.C12H10N2O6S3
Mol. Mass.374.413
SMILESNS(=O)(=O)c1ccc(cc1)N1S(=O)(=O)c2ccccc2S1(=O)=O