Reaction Details
TargetCarbonic anhydrase 1
LigandBDBM50429223
Substrate/Competitorn/a
Meas. Tech.ChEMBL_946166 (CHEMBL2344045)
Ki 27±n/a nM
Citation Güzel-Akdemir, ÖAkdemir, AIsik, SVullo, DSupuran, CT o-Benzenedisulfonimido-sulfonamides are potent inhibitors of the tumor-associated carbonic anhydrase isoforms CA IX and CA XII. Bioorg Med Chem21:1386-91 (2013) 
 
Carbonic anhydrase 1
Name:Carbonic anhydrase 1
Type:Enzyme
Mol. Mass.:28873.37
Organism:Homo sapiens (Human)
Description:P00915
Residue:261
BDBM50429223
NameBDBM50429223
Synonyms:CHEMBL2332768
TypeSmall organic molecule
Emp. Form.C13H12N2O6S3
Mol. Mass.388.439
SMILESNS(=O)(=O)c1ccc(CN2S(=O)(=O)c3ccccc3S2(=O)=O)cc1