Reaction Details
TargetAlpha-2A adrenergic receptor [16-465]
LigandBDBM50308002
Substrate/Competitorn/a
Meas. Tech.ChEMBL_947078 (CHEMBL2340583)
Ki 2490±n/a nM
Citation Gomes, TFPompeu, TERodrigues, DANoël, FMenegatti, RAndrade, CHSabino, JRGil, ESDalla Costa, TBetti, AHAntonio, CBRates, SMFraga, CABarreiro, EJde Oliveira, V Biotransformation of LASSBio-579 and pharmacological evaluation of p-hydroxylated metabolite a N-phenylpiperazine antipsychotic lead compound. Eur J Med Chem62:214-21 (2013) 
 
Alpha-2A adrenergic receptor [16-465]
Name:Alpha-2A adrenergic receptor [16-465]
Type:G-protein coupled receptor
Mol. Mass.:48961.69
Organism:Rattus norvegicus (rat)
Description:P22909[16-465]
Residue:450
BDBM50308002
NameBDBM50308002
Synonyms:1-[(1-(4-Chlorophenyl)-1H-pyrazol-4-yl)methyl]-4-phenylpiperazine | CHEMBL597601
TypeSmall organic molecule
Emp. Form.C20H21ClN4
Mol. Mass.352.861
SMILESClc1ccc(cc1)-n1cc(CN2CCN(CC2)c2ccccc2)cn1