Reaction Details
TargetHeat shock protein HSP 90-alpha
LigandBDBM50429457
Substrate/Competitorn/a
Meas. Tech.ChEMBL_943216 (CHEMBL2338980)
Kd 14±n/a nM
Citation Dal Piaz, FVassallo, ATemraz, ACotugno, RBelisario, MABifulco, GChini, MGPisano, CDe Tommasi, NBraca, A A chemical-biological study reveals C9-type iridoids as novel heat shock protein 90 (Hsp90) inhibitors. J Med Chem56:1583-95 (2013) 
 
Heat shock protein HSP 90-alpha
Name:Heat shock protein HSP 90-alpha
Type:Molecular Chaperone
Mol. Mass.:84623.45
Organism:Homo sapiens (Human)
Description:P07900
Residue:732
BDBM50429457
NameBDBM50429457
Synonyms:Argenteoside A | CHEMBL2332352
TypeSmall organic molecule
Emp. Form.C48H56O24
Mol. Mass.1016.9438
SMILESOC[C@H]1O[C@@H](O[C@@H]2OC=C[C@H]3[C@H](OC(=O)[C@H]4[C@@H]([C@H]([C@@H]4c4ccc(O)cc4)c4ccc(O)cc4)C(=O)O[C@@H]4[C@@H]5O[C@]5(CO)[C@@H]5[C@H]4C=CO[C@H]5O[C@@H]4O[C@H](CO)[C@@H](O)[C@H](O)[C@H]4O)[C@@H]4O[C@]4(CO)[C@@H]23)[C@H](O)[C@@H](O)[C@@H]1O