Reaction Details
TargetIntegrin alpha-V/beta-6
LigandBDBM50429461
Substrate/Competitorn/a
Meas. Tech.ChEMBL_943228 (CHEMBL2338992)
IC50 33±n/a nM
Citation Bochen, AMarelli, UKOtto, EPallarola, DMas-Moruno, CDi Leva, FSBoehm, HSpatz, JPNovellino, EKessler, HMarinelli, L Biselectivity of isoDGR peptides for fibronectin binding integrin subtypesa5ß1 andavß6: conformational control through flanking amino acids. J Med Chem56:1509-19 (2013) 
 
Integrin alpha-V/beta-6
Name:Integrin alpha-V/beta-6
Type:Enzyme
Mol. Mass.:n/a
Description:n/a
Components:This complex has 2 components.
Component 1
Name:Integrin alpha-V
Synonyms:ITAV_HUMAN Integrin alpha-V/alpha-5 VNRA Vitronectin receptor | Vitronectin receptor subunit alpha
Type:PROTEIN
Mol. Mass.:116024.92
Organism:Homo sapiens (Human)
Description:ChEMBL_582336
Residue:1048
Component 2
Name:Integrin beta-6
Synonyms:ITB6_HUMAN | ITGB6
Type:PROTEIN
Mol. Mass.:85919.61
Organism:Homo sapiens (Human)
Description:EBI_10916
Residue:788
BDBM50429461
NameBDBM50429461
Synonyms:CHEMBL2332369
TypeSmall organic molecule
Emp. Form.C43H77N15O17
Mol. Mass.1076.1618
SMILES[#6]-[#6](-[#6])-[#6]-[#6@H](-[#7]-[#6](=O)-[#6@H](-[#6]-[#8])-[#7]-[#6](=O)-[#6@H](-[#6]-[#6](-[#8])=O)-[#7]-[#6](=O)-[#6@H](-[#6]-[#6](-[#6])-[#6])-[#7]-[#6](=O)-[#6@H](-[#6]-[#6](-[#8])=O)-[#7]-[#6](=O)-[#6@@H](-[#7]-[#6](=O)-[#6@@H](-[#7])-[#6]-[#6]-[#6]\[#7]=[#6](/[#7])-[#7])-[#6@@H](-[#6])-[#8])-[#6](=O)-[#7]-[#6@@H](-[#6]-[#6]-[#6]\[#7]=[#6](/[#7])-[#7])-[#6](=O)-[#7]-[#6@@H](-[#6@@H](-[#6])-[#8])-[#6](-[#8])=O