Reaction Details
TargetVascular endothelial growth factor receptor 2
LigandBDBM50429490
Substrate/Competitorn/a
Meas. Tech.ChEMBL_943682 (CHEMBL2344826)
IC50>100000±n/a nM
Citation Yang, LLLi, GBMa, SZou, CZhou, SSun, QZCheng, CChen, XWang, LJFeng, SLi, LLYang, SY Structure-activity relationship studies of pyrazolo[3,4-d]pyrimidine derivatives leading to the discovery of a novel multikinase inhibitor that potently inhibits FLT3 and VEGFR2 and evaluation of its activity against acute myeloid leukemia in vitro and in vivo. J Med Chem56:1641-55 (2013) 
 
Vascular endothelial growth factor receptor 2
Name:Vascular endothelial growth factor receptor 2
Type:PROTEIN
Mol. Mass.:153046.15
Organism:Danio rerio
Description:ChEMBL_943682
Residue:1357
BDBM50429490
NameBDBM50429490
Synonyms:CHEMBL2332861
TypeSmall organic molecule
Emp. Form.C17H13N7O2
Mol. Mass.347.3308
SMILESO=C(Nc1ccc(Oc2ncnc3n[nH]cc23)cc1)Nc1cccnc1