Reaction Details
TargetVascular endothelial growth factor receptor 2
LigandBDBM50429496
Substrate/Competitorn/a
Meas. Tech.ChEMBL_943682 (CHEMBL2344826)
IC50>100000±n/a nM
Citation Yang, LLLi, GBMa, SZou, CZhou, SSun, QZCheng, CChen, XWang, LJFeng, SLi, LLYang, SY Structure-activity relationship studies of pyrazolo[3,4-d]pyrimidine derivatives leading to the discovery of a novel multikinase inhibitor that potently inhibits FLT3 and VEGFR2 and evaluation of its activity against acute myeloid leukemia in vitro and in vivo. J Med Chem56:1641-55 (2013) 
 
Vascular endothelial growth factor receptor 2
Name:Vascular endothelial growth factor receptor 2
Type:PROTEIN
Mol. Mass.:153046.15
Organism:Danio rerio
Description:ChEMBL_943682
Residue:1357
BDBM50429496
NameBDBM50429496
Synonyms:CHEMBL2332855
TypeSmall organic molecule
Emp. Form.C19H14BrN5O2
Mol. Mass.424.251
SMILESBrc1ccc(CC(=O)Nc2cccc(Oc3ncnc4n[nH]cc34)c2)cc1