Reaction Details
TargetCytochrome P450 11B1, mitochondrial
LigandBDBM50429516
Substrate/Competitorn/a
Meas. Tech.ChEMBL_944709 (CHEMBL2340955)
IC50 5.5±n/a nM
Citation Gobbi, SHu, QNegri, MZimmer, CBelluti, FRampa, AHartmann, RWBisi, A Modulation of cytochromes P450 with xanthone-based molecules: from aromatase to aldosterone synthase and steroid 11ß-hydroxylase inhibition. J Med Chem56:1723-9 (2013) 
 
Cytochrome P450 11B1, mitochondrial
Name:Cytochrome P450 11B1, mitochondrial
Type:Enzyme
Mol. Mass.:57591.44
Organism:Homo sapiens (Human)
Description:P15538
Residue:503
BDBM50429516
NameBDBM50429516
Synonyms:CHEMBL2333334
TypeSmall organic molecule
Emp. Form.C21H18N2O3
Mol. Mass.346.3792
SMILESO=c1c2ccccc2oc2c(OCC3CC3)ccc(Cn3ccnc3)c12