Reaction Details
TargetHistone deacetylase 4
LigandBDBM50015088
Substrate/Competitorn/a
Meas. Tech.ChEMBL_944721 (CHEMBL2340967)
Temperature298.15±n/a K
IC50 19460±n/a nM
Commentsextracted
Citation Wagner, FFOlson, DEGale, JPKaya, TWeïwer, MAidoud, NThomas, MDavoine, ELLemercier, BCZhang, YLHolson, EB Potent and selective inhibition of histone deacetylase 6 (HDAC6) does not require a surface-binding motif. J Med Chem56:1772-6 (2013) 
 
Histone deacetylase 4
Name:Histone deacetylase 4
Type:Enzyme
Mol. Mass.:119049.39
Organism:Homo sapiens (Human)
Description:P56524
Residue:1084
BDBM50015088
NameBDBM50015088
Synonyms:(E)-N-Hydroxy-3-phenyl-acrylamide CHEMBL154574 US10188756, Compound CN86 | trans-N-Hydroxy-3-phenyl-acrylamide
TypeSmall organic molecule
Emp. Form.C9H9NO2
Mol. Mass.163.1733
SMILESONC(=O)\C=C\c1ccccc1