Reaction Details
TargetHistone deacetylase 2
LigandBDBM50015088
Substrate/Competitorn/a
Meas. Tech.ChEMBL_944722 (CHEMBL2340968)
Temperature298.15±n/a K
IC50 457±n/a nM
Commentsextracted
Citation Wagner, FFOlson, DEGale, JPKaya, TWeïwer, MAidoud, NThomas, MDavoine, ELLemercier, BCZhang, YLHolson, EB Potent and selective inhibition of histone deacetylase 6 (HDAC6) does not require a surface-binding motif. J Med Chem56:1772-6 (2013) 
 
Histone deacetylase 2
Name:Histone deacetylase 2
Type:Chromatin regulator; hydrolase; repressor
Mol. Mass.:55356.54
Organism:Homo sapiens (Human)
Description:Q92769
Residue:488
BDBM50015088
NameBDBM50015088
Synonyms:(E)-N-Hydroxy-3-phenyl-acrylamide CHEMBL154574 US10188756, Compound CN86 | trans-N-Hydroxy-3-phenyl-acrylamide
TypeSmall organic molecule
Emp. Form.C9H9NO2
Mol. Mass.163.1733
SMILESONC(=O)\C=C\c1ccccc1