Reaction Details
TargetHistone deacetylase 1
LigandBDBM50429525
Substrate/Competitorn/a
Meas. Tech.ChEMBL_944714 (CHEMBL2340960)
Temperature298.15±n/a K
IC50 638±n/a nM
Commentsextracted
Citation Wagner, FFOlson, DEGale, JPKaya, TWeïwer, MAidoud, NThomas, MDavoine, ELLemercier, BCZhang, YLHolson, EB Potent and selective inhibition of histone deacetylase 6 (HDAC6) does not require a surface-binding motif. J Med Chem56:1772-6 (2013) 
 
Histone deacetylase 1
Name:Histone deacetylase 1
Type:Enzyme
Mol. Mass.:55090.27
Organism:Homo sapiens (Human)
Description:Q13547
Residue:482
BDBM50429525
NameBDBM50429525
Synonyms:CHEMBL2333346
TypeSmall organic molecule
Emp. Form.C6H9NO2
Mol. Mass.127.1412
SMILESONC(=O)C1=CCCC1