Reaction Details
TargetHistone deacetylase 6
LigandBDBM50429530
Substrate/Competitorn/a
Meas. Tech.ChEMBL_944720 (CHEMBL2340966)
Temperature298.15±n/a K
IC50 7.0±n/a nM
Commentsextracted
Citation Wagner, FFOlson, DEGale, JPKaya, TWeïwer, MAidoud, NThomas, MDavoine, ELLemercier, BCZhang, YLHolson, EB Potent and selective inhibition of histone deacetylase 6 (HDAC6) does not require a surface-binding motif. J Med Chem56:1772-6 (2013) 
 
Histone deacetylase 6
Name:Histone deacetylase 6
Type:Chromatin regulator; hydrolase; repressor
Mol. Mass.:131381.51
Organism:Homo sapiens (Human)
Description:Q9UBN7
Residue:1215
BDBM50429530
NameBDBM50429530
Synonyms:CHEMBL2333341
TypeSmall organic molecule
Emp. Form.C15H14N2O3
Mol. Mass.270.2833
SMILESONC(=O)c1ccc(cc1)C(=O)NCc1ccccc1