Reaction Details
TargetP2Y purinoceptor 11
LigandBDBM50429534
Substrate/Competitorn/a
Meas. Tech.ChEMBL_945219 (CHEMBL2339545)
Ki>15000±n/a nM
Citation Chao, HTurdi, HHerpin, TFRoberge, JYLiu, YSchnur, DMPoss, MARehfuss, RHua, JWu, QPrice, LAAbell, LMSchumacher, WABostwick, JSSteinbacher, TEStewart, ABOgletree, MLHuang, CSChang, MCacace, AMArcuri, MJCelani, DWexler, RRLawrence, RM Discovery of 2-(phenoxypyridine)-3-phenylureas as small molecule P2Y1 antagonists. J Med Chem56:1704-14 (2013) 
 
P2Y purinoceptor 11
Name:P2Y purinoceptor 11
Type:PROTEIN
Mol. Mass.:40366.02
Organism:Homo sapiens (Human)
Description:ChEMBL_1362532
Residue:374
BDBM50429534
NameBDBM50429534
Synonyms:CHEMBL2333773
TypeSmall organic molecule
Emp. Form.C22H20F3N3O3
Mol. Mass.431.4077
SMILESCC(C)c1ccccc1Oc1ncccc1NC(=O)Nc1ccc(OC(F)(F)F)cc1