Reaction Details
TargetP2Y purinoceptor 1
LigandBDBM50429534
Substrate/Competitorn/a
Meas. Tech.ChEMBL_945224 (CHEMBL2339550)
Ki 16±n/a nM
Citation Chao, HTurdi, HHerpin, TFRoberge, JYLiu, YSchnur, DMPoss, MARehfuss, RHua, JWu, QPrice, LAAbell, LMSchumacher, WABostwick, JSSteinbacher, TEStewart, ABOgletree, MLHuang, CSChang, MCacace, AMArcuri, MJCelani, DWexler, RRLawrence, RM Discovery of 2-(phenoxypyridine)-3-phenylureas as small molecule P2Y1 antagonists. J Med Chem56:1704-14 (2013) 
 
P2Y purinoceptor 1
Name:P2Y purinoceptor 1
Type:Enzyme
Mol. Mass.:42090.25
Organism:Homo sapiens (Human)
Description:P47900
Residue:373
BDBM50429534
NameBDBM50429534
Synonyms:CHEMBL2333773
TypeSmall organic molecule
Emp. Form.C22H20F3N3O3
Mol. Mass.431.4077
SMILESCC(C)c1ccccc1Oc1ncccc1NC(=O)Nc1ccc(OC(F)(F)F)cc1