Reaction Details
TargetP2Y purinoceptor 1
LigandBDBM50429546
Substrate/Competitorn/a
Meas. Tech.ChEMBL_945224 (CHEMBL2339550)
Ki 28±n/a nM
Citation Chao, HTurdi, HHerpin, TFRoberge, JYLiu, YSchnur, DMPoss, MARehfuss, RHua, JWu, QPrice, LAAbell, LMSchumacher, WABostwick, JSSteinbacher, TEStewart, ABOgletree, MLHuang, CSChang, MCacace, AMArcuri, MJCelani, DWexler, RRLawrence, RM Discovery of 2-(phenoxypyridine)-3-phenylureas as small molecule P2Y1 antagonists. J Med Chem56:1704-14 (2013) 
 
P2Y purinoceptor 1
Name:P2Y purinoceptor 1
Type:Enzyme
Mol. Mass.:42090.25
Organism:Homo sapiens (Human)
Description:P47900
Residue:373
BDBM50429546
NameBDBM50429546
Synonyms:CHEMBL2333761
TypeSmall organic molecule
Emp. Form.C21H19F2N3O2
Mol. Mass.383.3913
SMILESCC(C)c1ccccc1Oc1ncccc1NC(=O)Nc1ccc(F)cc1F