Reaction Details
TargetP2Y purinoceptor 1
LigandBDBM50429548
Substrate/Competitorn/a
Meas. Tech.ChEMBL_945224 (CHEMBL2339550)
Ki 18±n/a nM
Citation Chao, HTurdi, HHerpin, TFRoberge, JYLiu, YSchnur, DMPoss, MARehfuss, RHua, JWu, QPrice, LAAbell, LMSchumacher, WABostwick, JSSteinbacher, TEStewart, ABOgletree, MLHuang, CSChang, MCacace, AMArcuri, MJCelani, DWexler, RRLawrence, RM Discovery of 2-(phenoxypyridine)-3-phenylureas as small molecule P2Y1 antagonists. J Med Chem56:1704-14 (2013) 
 
P2Y purinoceptor 1
Name:P2Y purinoceptor 1
Type:Enzyme
Mol. Mass.:42090.25
Organism:Homo sapiens (Human)
Description:P47900
Residue:373
BDBM50429548
NameBDBM50429548
Synonyms:CHEMBL2333759
TypeSmall organic molecule
Emp. Form.C22H21F2N3O2
Mol. Mass.397.4178
SMILESCC(C)(C)c1ccccc1Oc1ncccc1NC(=O)Nc1ccc(F)cc1F