Reaction Details
TargetP2Y purinoceptor 1
LigandBDBM50429552
Substrate/Competitorn/a
Meas. Tech.ChEMBL_945224 (CHEMBL2339550)
Ki 169±n/a nM
Citation Chao, HTurdi, HHerpin, TFRoberge, JYLiu, YSchnur, DMPoss, MARehfuss, RHua, JWu, QPrice, LAAbell, LMSchumacher, WABostwick, JSSteinbacher, TEStewart, ABOgletree, MLHuang, CSChang, MCacace, AMArcuri, MJCelani, DWexler, RRLawrence, RM Discovery of 2-(phenoxypyridine)-3-phenylureas as small molecule P2Y1 antagonists. J Med Chem56:1704-14 (2013) 
 
P2Y purinoceptor 1
Name:P2Y purinoceptor 1
Type:Enzyme
Mol. Mass.:42090.25
Organism:Homo sapiens (Human)
Description:P47900
Residue:373
BDBM50429552
NameBDBM50429552
Synonyms:CHEMBL2333756
TypeSmall organic molecule
Emp. Form.C19H12Cl2F3N3O2
Mol. Mass.442.219
SMILESFC(F)(F)c1cccc(Oc2ncccc2NC(=O)Nc2cc(Cl)cc(Cl)c2)c1