Reaction Details
TargetP2Y purinoceptor 1
LigandBDBM50429560
Substrate/Competitorn/a
Meas. Tech.ChEMBL_945224 (CHEMBL2339550)
Ki 31±n/a nM
Citation Chao, HTurdi, HHerpin, TFRoberge, JYLiu, YSchnur, DMPoss, MARehfuss, RHua, JWu, QPrice, LAAbell, LMSchumacher, WABostwick, JSSteinbacher, TEStewart, ABOgletree, MLHuang, CSChang, MCacace, AMArcuri, MJCelani, DWexler, RRLawrence, RM Discovery of 2-(phenoxypyridine)-3-phenylureas as small molecule P2Y1 antagonists. J Med Chem56:1704-14 (2013) 
 
P2Y purinoceptor 1
Name:P2Y purinoceptor 1
Type:Enzyme
Mol. Mass.:42090.25
Organism:Homo sapiens (Human)
Description:P47900
Residue:373
BDBM50429560
NameBDBM50429560
Synonyms:CHEMBL2333354
TypeSmall organic molecule
Emp. Form.C23H22F3N3O2
Mol. Mass.429.4349
SMILESCC(C)(C)c1ccc(NC(=O)Nc2cccnc2Oc2cccc(c2)C(F)(F)F)cc1