Reaction Details
TargetSterol O-acyltransferase 2
LigandBDBM50429588
Substrate/Competitorn/a
Meas. Tech.ChEMBL_945256 (CHEMBL2339988)
IC50 9.0±n/a nM
Citation Ohtawa, MYamazaki, HOhte, SMatsuda, DOhshiro, TRudel, LLOmura, STomoda, HNagamitsu, T Synthesis and structure-activity relationship of pyripyropene A derivatives as potent and selective acyl-CoA:cholesterol acyltransferase 2 (ACAT2) inhibitors: part 1. Bioorg Med Chem Lett23:1285-7 (2013) 
 
Sterol O-acyltransferase 2
Name:Sterol O-acyltransferase 2
Type:Enzyme
Mol. Mass.:59912.75
Organism:Homo sapiens (Human)
Description:O75908
Residue:522
BDBM50429588
NameBDBM50429588
Synonyms:CHEMBL2334201
TypeSmall organic molecule
Emp. Form.C37H41NO10S
Mol. Mass.691.787
SMILESCSc1cccc(c1)C(=O)O[C@H]1C[C@H]2[C@](C)(COC(C)=O)[C@H](CC[C@]2(C)[C@H]2[C@@H](O)c3c(O[C@]12C)cc(oc3=O)-c1cccnc1)OC(C)=O