Reaction Details
TargetMitogen-activated protein kinase kinase kinase 14
LigandBDBM50429615
Substrate/Competitorn/a
Meas. Tech.ChEMBL_945747 (CHEMBL2346384)
IC50 41±n/a nM
Citation Li, KMcGee, LRFisher, BSudom, ALiu, JRubenstein, SMAnwer, MKCushing, TDShin, YAyres, MLee, FEksterowicz, JFaulder, PWaszkowycz, BPlotnikova, OFarrelly, EXiao, SHChen, GWang, Z Inhibiting NF-¿B-inducing kinase (NIK): discovery, structure-based design, synthesis, structure-activity relationship, and co-crystal structures. Bioorg Med Chem Lett23:1238-44 (2013) 
 
Mitogen-activated protein kinase kinase kinase 14
Name:Mitogen-activated protein kinase kinase kinase 14
Type:Protein
Mol. Mass.:104059.50
Organism:Homo sapiens (Human)
Description:Q99558
Residue:947
BDBM50429615
NameBDBM50429615
Synonyms:CHEMBL2334586
TypeSmall organic molecule
Emp. Form.C20H20N4O
Mol. Mass.332.399
SMILESCC(C)(O)C#Cc1ccc2[nH]c3CCCc4cnc(N)nc4-c3c2c1